• building scribus-devel 1.5.3


    Hi,

    installing scribus 1.4 works flawless. But trying to build scribus-devel 1.5.3 always ends with a build() error.

    make[2]: *** [scribus/CMakeFiles/scribus.dir/build.make:7511: scribus/CMakeFiles/scribus.dir/ui/moc_propertiespalette_shape.cpp.o] Fehler 1
    make[1]: *** [CMakeFiles/Makefile2:157: scribus/CMakeFiles/scribus.dir/all] Fehler 2
    make: *** [Makefile:152: all] Fehler 2
    ==> FEHLER: Ein Fehler geschah in build().
    

    how would I solve this?

  • use scribus-svn it builds fine:

    0_1519551926706_Bildschirmfoto_2018-02-25_10-44-06.png

  • then I probably have something messed up with my system. svn is not building, either:

    make[2]: *** [scribus/CMakeFiles/scribus.dir/build.make:7565: scribus/CMakeFiles/scribus.dir/ui/moc_propertiespalette_shape.cpp.o] Fehler 1
    make[1]: *** [CMakeFiles/Makefile2:197: scribus/CMakeFiles/scribus.dir/all] Fehler 2
    make: *** [Makefile:152: all] Fehler 2
    
  • http://kamprad.net/Downloads/scribus-svn-22409-1-x86_64.pkg.tar

    If you mind try mine out… may you can not build caus dependency problems…

building4 scribus-devel1 1.5.31 Posts 4Views 279
Bloom Email Optin Plugin

Looks like your connection to Antergos Community Forum was lost, please wait while we try to reconnect.