I have this error updating to palemoon 27.6.0-1 from 27.5.1
Before this error I had python dbus module error installed pyton2 dbus now I have the error below…

6:47.34 pkgdata: cd …/lib/ && rm -f libicudata.so.58 && ln -s libicudata.so.58.2 libicudata.so.58
6:47.34 pkgdata: cd …/lib/ && rm -f libicudata.so && ln -s libicudata.so.58.2 libicudata.so
6:47.34 Note: rebuild with “/usr/bin/make VERBOSE=1 all-local” to show all compiler parameters.
6:47.35 make[3]: *** [/tmp/pamac-build-koo/palemoon/src/Pale-Moon/config/recurse.mk:37: compile] Error 2
6:47.35 make[2]: *** [/tmp/pamac-build-koo/palemoon/src/Pale-Moon/config/rules.mk:541: default] Error 2
6:47.35 make[1]: *** [/tmp/pamac-build-koo/palemoon/src/Pale-Moon/client.mk:399: realbuild] Error 2
6:47.35 make: *** [client.mk:171: build] Error 2
6:47.36 114 compiler warnings present.
==> ERROR: A failure occurred in build().
Aborting…
Any help Thank You


I run this command and now is fixed…

gpg --recv-keys 865E6C87C65285EC

gpg: key 865E6C87C65285EC: 3 signatures not checked due to missing keys
gpg: key 865E6C87C65285EC: public key “trava90 [email protected]” imported
gpg: no ultimately trusted keys found
gpg: Total number processed: 1
gpg: imported: 1