Hi
I am getting error when i try to install turbovnc, I normally search and always find someone has had the same problem before.
Just this time i couldn’t find anyone else with this error by searching.

[ 45%] Building C object unix/Xvnc/programs/Xserver/hw/vnc/CMakeFiles/vnc.dir/rfbssl_openssl.c.o
/tmp/yaourt-tmp-shared/aur-turbovnc/src/turbovnc-2.1.1/unix/Xvnc/programs/Xserver/hw/vnc/rfbssl_openssl.c: In function ‘rfbssl_init’:
/tmp/yaourt-tmp-shared/aur-turbovnc/src/turbovnc-2.1.1/unix/Xvnc/programs/Xserver/hw/vnc/rfbssl_openssl.c:279:8: error: ‘struct rfbssl_functions’ has no member named ‘OPENSSL_init_ssl’
     ssl.SSL_library_init();
        ^
/tmp/yaourt-tmp-shared/aur-turbovnc/src/turbovnc-2.1.1/unix/Xvnc/programs/Xserver/hw/vnc/rfbssl_openssl.c:280:8: error: ‘struct rfbssl_functions’ has no member named ‘OPENSSL_init_ssl’
     ssl.SSL_load_error_strings();
        ^
make[2]: *** [unix/Xvnc/programs/Xserver/hw/vnc/CMakeFiles/vnc.dir/build.make:735: unix/Xvnc/programs/Xserver/hw/vnc/CMakeFiles/vnc.dir/rfbssl_openssl.c.o] Error 1
make[1]: *** [CMakeFiles/Makefile2:3151: unix/Xvnc/programs/Xserver/hw/vnc/CMakeFiles/vnc.dir/all] Error 2
make: *** [Makefile:130: all] Error 2
==> ERROR: A failure occurred in build().
    Aborting...
==> ERROR: Makepkg was unable to build turbovnc.
==> Restart building turbovnc ? [y/N]
==> ---------------------------------
==>