• mono develop install error


    Hello everyone!
    I’m new to this forum, so if I posted in wrong section please re-direct me to correct one.
    I want to start learning C#. So on my fresh antergos ( x86_x64) I try to install mono develop via “add/remove software”. But I get every time error message something about fhsarp. Then I dig into for more info and I got this:

    Preparing...
    
    Building fsharp...
    Cloning into 'fsharp'...
    remote: Enumerating objects: 104, done.        
    remote: Counting objects: 100% (104/104), done.        
    remote: Compressing objects: 100% (76/76), done.        
    remote: Total 104 (delta 28), reused 103 (delta 28)        
    Receiving objects: 100% (104/104), 22.99 KiB | 5.75 MiB/s, done.
    Resolving deltas: 100% (28/28), done.
    ==> Making package: fsharp 4.1.34-2 (Sat 18 Aug 2018 05:20:51 PM CEST)
    ==> Checking runtime dependencies...
    ==> Checking buildtime dependencies...
    ==> Retrieving sources...
      -> Cloning fsharp git repo...
    Cloning into bare repository '/tmp/pamac-build-chaka/fsharp/fsharp'...
    remote: Counting objects: 87457, done.        
    remote: Compressing objects: 100% (132/132), done.        
    remote: Total 87457 (delta 41), reused 48 (delta 15), pack-reused 87307        
    Receiving objects: 100% (87457/87457), 187.17 MiB | 846.00 KiB/s, done.
    Resolving deltas: 100% (61869/61869), done.
    ==> Validating source files with sha256sums...
        fsharp ... Skipped
    ==> Extracting sources...
      -> Creating working copy of fsharp git repo...
    Cloning into 'fsharp'...
    done.
    Switched to a new branch 'makepkg'
    ==> Starting pkgver()...
    ==> Starting build()...
    checking whether make sets $(MAKE)... yes
    checking for pkg-config... /usr/bin/pkg-config
    configure: "pkg-config: /usr/bin/pkg-config"
    configure: "PKG_CONFIG_LIBDIR: "
    checking for msbuild... /usr/bin/msbuild
    configure: msbuild: /usr/bin/msbuild
    configure: creating ./config.status
    config.status: creating mono/launcher
    config.status: creating mono/config.make
    make build-proto
    make[1]: Entering directory '/tmp/pamac-build-chaka/fsharp/src/fsharp'
    MONO_ENV_OPTIONS= mono .nuget/NuGet.exe restore packages.config -PackagesDirectory packages -ConfigFile .nuget/NuGet.Config
    Restoring NuGet package Microsoft.Build.Utilities.Core.14.3.0.
    Restoring NuGet package System.Reflection.Metadata.1.4.2.
    Restoring NuGet package MicroBuild.Core.0.2.0.
    Restoring NuGet package Microsoft.Build.14.3.0.
    Restoring NuGet package Microsoft.DiaSymReader.1.1.0.
    Restoring NuGet package System.Collections.Immutable.1.3.1.
    Restoring NuGet package Microsoft.DiaSymReader.PortablePdb.1.2.0.
    Restoring NuGet package Microsoft.Build.Framework.14.3.0.
    Restoring NuGet package FsLexYacc.7.0.6.
    Restoring NuGet package System.ValueTuple.4.3.1.
    Adding package 'System.Collections.Immutable.1.3.1' to folder '/tmp/pamac-build-chaka/fsharp/src/fsharp/packages'
    Adding package 'Microsoft.Build.14.3.0' to folder '/tmp/pamac-build-chaka/fsharp/src/fsharp/packages'
    Adding package 'FsLexYacc.7.0.6' to folder '/tmp/pamac-build-chaka/fsharp/src/fsharp/packages'
    Adding package 'Microsoft.DiaSymReader.1.1.0' to folder '/tmp/pamac-build-chaka/fsharp/src/fsharp/packages'
    Adding package 'System.Reflection.Metadata.1.4.2' to folder '/tmp/pamac-build-chaka/fsharp/src/fsharp/packages'
    Adding package 'System.ValueTuple.4.3.1' to folder '/tmp/pamac-build-chaka/fsharp/src/fsharp/packages'
    Adding package 'MicroBuild.Core.0.2.0' to folder '/tmp/pamac-build-chaka/fsharp/src/fsharp/packages'
    Adding package 'Microsoft.Build.Framework.14.3.0' to folder '/tmp/pamac-build-chaka/fsharp/src/fsharp/packages'
    Adding package 'Microsoft.Build.Utilities.Core.14.3.0' to folder '/tmp/pamac-build-chaka/fsharp/src/fsharp/packages'
    Adding package 'Microsoft.DiaSymReader.PortablePdb.1.2.0' to folder '/tmp/pamac-build-chaka/fsharp/src/fsharp/packages'
    Added package 'MicroBuild.Core.0.2.0' to folder '/tmp/pamac-build-chaka/fsharp/src/fsharp/packages'
    Added package 'Microsoft.Build.Framework.14.3.0' to folder '/tmp/pamac-build-chaka/fsharp/src/fsharp/packages'
    Added package 'Microsoft.Build.Utilities.Core.14.3.0' to folder '/tmp/pamac-build-chaka/fsharp/src/fsharp/packages'
    Restoring NuGet package NUnit.3.5.0.
    Restoring NuGet package FsCheck.2.6.2.
    Restoring NuGet package Microsoft.Build.Tasks.Core.14.3.0.
    Added package 'Microsoft.DiaSymReader.1.1.0' to folder '/tmp/pamac-build-chaka/fsharp/src/fsharp/packages'
    Added package 'Microsoft.DiaSymReader.PortablePdb.1.2.0' to folder '/tmp/pamac-build-chaka/fsharp/src/fsharp/packages'
    Restoring NuGet package NUnitLite.3.5.0.
    Restoring NuGet package NUnit.Console.3.0.0.
    Adding package 'NUnit.3.5.0' to folder '/tmp/pamac-build-chaka/fsharp/src/fsharp/packages'
    Adding package 'NUnitLite.3.5.0' to folder '/tmp/pamac-build-chaka/fsharp/src/fsharp/packages'
    Adding package 'NUnit.Console.3.0.0' to folder '/tmp/pamac-build-chaka/fsharp/src/fsharp/packages'
    Adding package 'FsCheck.2.6.2' to folder '/tmp/pamac-build-chaka/fsharp/src/fsharp/packages'
    Adding package 'Microsoft.Build.Tasks.Core.14.3.0' to folder '/tmp/pamac-build-chaka/fsharp/src/fsharp/packages'
    Added package 'System.ValueTuple.4.3.1' to folder '/tmp/pamac-build-chaka/fsharp/src/fsharp/packages'
    Restoring NuGet package NUnit3TestAdapter.3.0.8-ctp-8.
    Adding package 'NUnit3TestAdapter.3.0.8-ctp-8' to folder '/tmp/pamac-build-chaka/fsharp/src/fsharp/packages'
    Added package 'Microsoft.Build.14.3.0' to folder '/tmp/pamac-build-chaka/fsharp/src/fsharp/packages'
    Restoring NuGet package BenchmarkDotNet.0.9.8.
    Adding package 'BenchmarkDotNet.0.9.8' to folder '/tmp/pamac-build-chaka/fsharp/src/fsharp/packages'
    Added package 'System.Collections.Immutable.1.3.1' to folder '/tmp/pamac-build-chaka/fsharp/src/fsharp/packages'
    Restoring NuGet package BenchmarkDotNet.Diagnostics.Windows.0.9.8.
    Adding package 'BenchmarkDotNet.Diagnostics.Windows.0.9.8' to folder '/tmp/pamac-build-chaka/fsharp/src/fsharp/packages'
    Added package 'BenchmarkDotNet.Diagnostics.Windows.0.9.8' to folder '/tmp/pamac-build-chaka/fsharp/src/fsharp/packages'
    Restoring NuGet package Newtonsoft.Json.8.0.1.
    Added package 'Microsoft.Build.Tasks.Core.14.3.0' to folder '/tmp/pamac-build-chaka/fsharp/src/fsharp/packages'
    Restoring NuGet package FSharp.Compiler.Tools.4.1.27.
    Adding package 'Newtonsoft.Json.8.0.1' to folder '/tmp/pamac-build-chaka/fsharp/src/fsharp/packages'
    Added package 'System.Reflection.Metadata.1.4.2' to folder '/tmp/pamac-build-chaka/fsharp/src/fsharp/packages'
    Restoring NuGet package Microsoft.Portable.FSharp.Core.4.1.20.
    Adding package 'FSharp.Compiler.Tools.4.1.27' to folder '/tmp/pamac-build-chaka/fsharp/src/fsharp/packages'
    Added package 'BenchmarkDotNet.0.9.8' to folder '/tmp/pamac-build-chaka/fsharp/src/fsharp/packages'
    Restoring NuGet package FSharp.Core.4.1.17.
    Added package 'NUnit3TestAdapter.3.0.8-ctp-8' to folder '/tmp/pamac-build-chaka/fsharp/src/fsharp/packages'
    Adding package 'FSharp.Core.4.1.17' to folder '/tmp/pamac-build-chaka/fsharp/src/fsharp/packages'
    Restoring NuGet package FSharp.Core.4.0.0.1.
    Adding package 'Microsoft.Portable.FSharp.Core.4.1.20' to folder '/tmp/pamac-build-chaka/fsharp/src/fsharp/packages'
    Adding package 'FSharp.Core.4.0.0.1' to folder '/tmp/pamac-build-chaka/fsharp/src/fsharp/packages'
    Added package 'FsLexYacc.7.0.6' to folder '/tmp/pamac-build-chaka/fsharp/src/fsharp/packages'
    Restoring NuGet package FSharp.Core.3.1.2.5.
    Adding package 'FSharp.Core.3.1.2.5' to folder '/tmp/pamac-build-chaka/fsharp/src/fsharp/packages'
    Added package 'NUnitLite.3.5.0' to folder '/tmp/pamac-build-chaka/fsharp/src/fsharp/packages'
    Restoring NuGet package FSharp.Core.3.0.2.
    Added package 'NUnit.Console.3.0.0' to folder '/tmp/pamac-build-chaka/fsharp/src/fsharp/packages'
    Adding package 'FSharp.Core.3.0.2' to folder '/tmp/pamac-build-chaka/fsharp/src/fsharp/packages'
    Restoring NuGet package FSharp.Data.2.2.5.
    Adding package 'FSharp.Data.2.2.5' to folder '/tmp/pamac-build-chaka/fsharp/src/fsharp/packages'
    Added package 'NUnit.3.5.0' to folder '/tmp/pamac-build-chaka/fsharp/src/fsharp/packages'
    Restoring NuGet package FSharp.Configuration.1.3.0.
    Adding package 'FSharp.Configuration.1.3.0' to folder '/tmp/pamac-build-chaka/fsharp/src/fsharp/packages'
    Added package 'FsCheck.2.6.2' to folder '/tmp/pamac-build-chaka/fsharp/src/fsharp/packages'
    Added package 'Newtonsoft.Json.8.0.1' to folder '/tmp/pamac-build-chaka/fsharp/src/fsharp/packages'
    Added package 'FSharp.Configuration.1.3.0' to folder '/tmp/pamac-build-chaka/fsharp/src/fsharp/packages'
    Added package 'FSharp.Core.3.0.2' to folder '/tmp/pamac-build-chaka/fsharp/src/fsharp/packages'
    Added package 'FSharp.Data.2.2.5' to folder '/tmp/pamac-build-chaka/fsharp/src/fsharp/packages'
    Added package 'FSharp.Core.4.0.0.1' to folder '/tmp/pamac-build-chaka/fsharp/src/fsharp/packages'
    Added package 'FSharp.Core.3.1.2.5' to folder '/tmp/pamac-build-chaka/fsharp/src/fsharp/packages'
    Added package 'FSharp.Core.4.1.17' to folder '/tmp/pamac-build-chaka/fsharp/src/fsharp/packages'
    Added package 'FSharp.Compiler.Tools.4.1.27' to folder '/tmp/pamac-build-chaka/fsharp/src/fsharp/packages'
    Added package 'Microsoft.Portable.FSharp.Core.4.1.20' to folder '/tmp/pamac-build-chaka/fsharp/src/fsharp/packages'
    
    NuGet Config files used:
        /tmp/pamac-build-chaka/fsharp/src/fsharp/.nuget/NuGet.Config
    
    Feeds used:
        /home/chaka/.nuget/packages/
        https://api.nuget.org/v3/index.json
    
    Installed:
        27 package(s) to packages.config projects
    MONO_ENV_OPTIONS= /usr/bin/msbuild /p:Configuration=Proto /p:TargetDotnetProfile=net40 src/fsharp/FSharp.Build-proto/FSharp.Build-proto.fsproj
    Microsoft (R) Build Engine version 15.6.0.0 ( Fri Apr  6 15:55:10 UTC 2018) for Mono
    Copyright (C) Microsoft Corporation. All rights reserved.
    
    Build started 8/18/2018 5:24:47 PM.
    Project "/tmp/pamac-build-chaka/fsharp/src/fsharp/src/fsharp/FSharp.Build-proto/FSharp.Build-proto.fsproj" on node 1 (default targets).
    CallFsSrGen:
      Creating directory "obj/Proto/net40/".
      mono /tmp/pamac-build-chaka/fsharp/src/fsharp/packages/FSharp.Compiler.Tools.4.1.27/tools/fsi.exe --exec "/tmp/pamac-build-chaka/fsharp/src/fsharp/src/scripts/fssrgen.fsx" "/tmp/pamac-build-chaka/fsharp/src/fsharp/src/fsharp/FSharp.Build/FSBuild.txt" "obj/Proto/net40/FSBuild.fs"  "obj/Proto/net40/FSBuild.resx" 
      fssrgen: args = [|"/tmp/pamac-build-chaka/fsharp/src/fsharp/src/scripts/fssrgen.fsx";
        "/tmp/pamac-build-chaka/fsharp/src/fsharp/src/fsharp/FSharp.Build/FSBuild.txt";
        "obj/Proto/net40/FSBuild.fs"; "obj/Proto/net40/FSBuild.resx"|]
      fssrgen.fsx: Reading /tmp/pamac-build-chaka/fsharp/src/fsharp/src/fsharp/FSharp.Build/FSBuild.txt
      fssrgen.fsx: Parsing /tmp/pamac-build-chaka/fsharp/src/fsharp/src/fsharp/FSharp.Build/FSBuild.txt
      fssrgen.fsx: Validating /tmp/pamac-build-chaka/fsharp/src/fsharp/src/fsharp/FSharp.Build/FSBuild.txt
      fssrgen.fsx: Validating uniqueness of /tmp/pamac-build-chaka/fsharp/src/fsharp/src/fsharp/FSharp.Build/FSBuild.txt
      fssrgen.fsx: Generating /tmp/pamac-build-chaka/fsharp/src/fsharp/src/fsharp/FSharp.Build-proto/obj/Proto/net40/FSBuild.fs
      fssrgen.fsx: Generating resource methods for /tmp/pamac-build-chaka/fsharp/src/fsharp/src/fsharp/FSharp.Build-proto/obj/Proto/net40/FSBuild.fs
      fssrgen.fsx: Generating .resx for /tmp/pamac-build-chaka/fsharp/src/fsharp/src/fsharp/FSharp.Build-proto/obj/Proto/net40/FSBuild.fs
      fssrgen.fsx: Done /tmp/pamac-build-chaka/fsharp/src/fsharp/src/fsharp/FSharp.Build-proto/obj/Proto/net40/FSBuild.fs
    PrepareForBuild:
      Creating directory "/tmp/pamac-build-chaka/fsharp/src/fsharp/src/fsharp/FSharp.Build-proto/../../../Proto/net40/bin/".
    CoreResGen:
      /usr/lib/mono/4.5/resgen.exe /useSourcePath /r:/tmp/pamac-build-chaka/fsharp/src/fsharp/packages/Microsoft.Build.14.3.0/lib/net45/Microsoft.Build.dll /r:/tmp/pamac-build-chaka/fsharp/src/fsharp/packages/Microsoft.Build.Framework.14.3.0/lib/net45/Microsoft.Build.Framework.dll /r:/tmp/pamac-build-chaka/fsharp/src/fsharp/packages/Microsoft.Build.Tasks.Core.14.3.0/lib/net45/Microsoft.Build.Tasks.Core.dll /r:/tmp/pamac-build-chaka/fsharp/src/fsharp/packages/Microsoft.Build.Utilities.Core.14.3.0/lib/net45/Microsoft.Build.Utilities.Core.dll /r:/usr/lib/mono/4.5-api/mscorlib.dll /r:/usr/lib/mono/4.5-api/System.Core.dll /r:/usr/lib/mono/4.5-api/System.dll /r:/usr/lib/mono/4.5-api/System.Numerics.dll /r:/usr/lib/mono/4.5-api/System.Xml.dll /r:/usr/lib/mono/4.5-api/System.Xml.Linq.dll /compile obj/Proto/net40/FSBuild.resx,obj/Proto/net40/FSBuild.resources
      Processing resource file "obj/Proto/net40/FSBuild.resx" into "obj/Proto/net40/FSBuild.resources".
    GenerateTargetFrameworkMonikerAttribute:
    Skipping target "GenerateTargetFrameworkMonikerAttribute" because all output files are up-to-date with respect to the input files.
    CoreCompile:
      /tmp/pamac-build-chaka/fsharp/src/fsharp/packages/FSharp.Compiler.Tools.4.1.27/tools/fsc.exe -o:obj/Proto/net40/FSharp.Build-proto.dll
      -g
      --debug:portable
      --noframework
      --define:MSBUILD_AT_LEAST_14
      --define:STRONG_NAME_FSHARP_COMPILER_WITH_TEST_KEY
      --define:BUILDING_WITH_LKG
      --define:DEBUG
      --define:NO_STRONG_NAMES
      --define:VS_VERSION_DEV15
      --define:CROSS_PLATFORM_COMPILER
      --define:ENABLE_MONO_SUPPORT
      --define:BE_SECURITY_TRANSPARENT
      --define:FX_LCIDFROMCODEPAGE
      --doc:/tmp/pamac-build-chaka/fsharp/src/fsharp/src/fsharp/FSharp.Build-proto/../../../Proto/net40/bin/FSharp.Build-proto.xml
      --keyfile:/tmp/pamac-build-chaka/fsharp/src/fsharp/src/fsharp/FSharp.Build-proto/../../fsharp/test.snk
      --optimize+
      --resource:obj/Proto/net40/FSBuild.resources
      -r:/tmp/pamac-build-chaka/fsharp/src/fsharp/src/fsharp/FSharp.Build-proto/../../../packages/Microsoft.Build.14.3.0/lib/net45/Microsoft.Build.dll
      -r:/tmp/pamac-build-chaka/fsharp/src/fsharp/src/fsharp/FSharp.Build-proto/../../../packages/Microsoft.Build.Framework.14.3.0/lib/net45/Microsoft.Build.Framework.dll
      -r:/tmp/pamac-build-chaka/fsharp/src/fsharp/src/fsharp/FSharp.Build-proto/../../../packages/Microsoft.Build.Tasks.Core.14.3.0/lib/net45/Microsoft.Build.Tasks.Core.dll
      -r:/tmp/pamac-build-chaka/fsharp/src/fsharp/src/fsharp/FSharp.Build-proto/../../../packages/Microsoft.Build.Utilities.Core.14.3.0/lib/net45/Microsoft.Build.Utilities.Core.dll
      -r:/usr/lib/mono/4.5-api/mscorlib.dll
      -r:/usr/lib/mono/4.5-api/System.Core.dll
      -r:/usr/lib/mono/4.5-api/System.dll
      -r:/usr/lib/mono/4.5-api/System.Numerics.dll
      -r:/usr/lib/mono/4.5-api/System.Xml.dll
      -r:/usr/lib/mono/4.5-api/System.Xml.Linq.dll
      --target:library
      --nowarn:69,65,54,61,75
      --warn:3
      --warnaserror
      --warnaserror:76
      --fullpaths
      --flaterrors
      --subsystemversion:6.00
      --highentropyva+
      --times
      --version:4.4.1.0
      obj/Proto/net40/FSBuild.fs
      ../../utils/CompilerLocationUtils.fs
      ../FSharp.Build/CreateFSharpManifestResourceName.fs
      ../FSharp.Build/FSharpCommandLineBuilder.fs
      ../FSharp.Build/Fsc.fs
      ../FSharp.Build/FSharpEmbedResourceText.fs
      ../FSharp.Build/FSharpEmbedResXSource.fs
      ../FSharp.Build/WriteCodeFragment.fs
      /tmp/.NETFramework,Version=v4.5.AssemblyAttributes.fs
      
    CopyAndSubstituteTextFiles:
      mono /tmp/pamac-build-chaka/fsharp/src/fsharp/packages/FSharp.Compiler.Tools.4.1.27/tools/fsi.exe --exec "/tmp/pamac-build-chaka/fsharp/src/fsharp/src/scripts/subst.fsx" --in:"/tmp/pamac-build-chaka/fsharp/src/fsharp/src/fsharp/FSharp.Build/Microsoft.FSharp.Targets" --out:"/tmp/pamac-build-chaka/fsharp/src/fsharp/src/fsharp/FSharp.Build-proto/../../../Proto/net40/bin/Microsoft.FSharp-proto.targets" --pattern1:"{BuildSuffix}" --replacement1:"-proto" --pattern2:"" --replacement2:"" 
      
      
    /tmp/pamac-build-chaka/fsharp/src/fsharp/src/scripts/scriptlib.fsx(40,39): error FS0041: A unique overload for method 'StartsWith' could not be determined based on type information prior to this program point. A type annotation may be needed. Candidates: String.StartsWith(value: char) : bool, String.StartsWith(value: string) : bool [/tmp/pamac-build-chaka/fsharp/src/fsharp/src/fsharp/FSharp.Build-proto/FSharp.Build-proto.fsproj]
      
    /tmp/pamac-build-chaka/fsharp/src/fsharp/src/FSharpSource.targets(207,5): error MSB3073: The command "mono /tmp/pamac-build-chaka/fsharp/src/fsharp/packages/FSharp.Compiler.Tools.4.1.27/tools/fsi.exe --exec "/tmp/pamac-build-chaka/fsharp/src/fsharp/src/scripts/subst.fsx" --in:"/tmp/pamac-build-chaka/fsharp/src/fsharp/src/fsharp/FSharp.Build/Microsoft.FSharp.Targets" --out:"/tmp/pamac-build-chaka/fsharp/src/fsharp/src/fsharp/FSharp.Build-proto/../../../Proto/net40/bin/Microsoft.FSharp-proto.targets" --pattern1:"{BuildSuffix}" --replacement1:"-proto" --pattern2:"" --replacement2:"" " exited with code 1. [/tmp/pamac-build-chaka/fsharp/src/fsharp/src/fsharp/FSharp.Build-proto/FSharp.Build-proto.fsproj]
    Done Building Project "/tmp/pamac-build-chaka/fsharp/src/fsharp/src/fsharp/FSharp.Build-proto/FSharp.Build-proto.fsproj" (default targets) -- FAILED.
    
    Build FAILED.
    
    "/tmp/pamac-build-chaka/fsharp/src/fsharp/src/fsharp/FSharp.Build-proto/FSharp.Build-proto.fsproj" (default target) (1) ->
    (CopyAndSubstituteTextFiles target) -> 
      /tmp/pamac-build-chaka/fsharp/src/fsharp/src/scripts/scriptlib.fsx(40,39): error FS0041: A unique overload for method 'StartsWith' could not be determined based on type information prior to this program point. A type annotation may be needed. Candidates: String.StartsWith(value: char) : bool, String.StartsWith(value: string) : bool [/tmp/pamac-build-chaka/fsharp/src/fsharp/src/fsharp/FSharp.Build-proto/FSharp.Build-proto.fsproj]
      /tmp/pamac-build-chaka/fsharp/src/fsharp/src/FSharpSource.targets(207,5): error MSB3073: The command "mono /tmp/pamac-build-chaka/fsharp/src/fsharp/packages/FSharp.Compiler.Tools.4.1.27/tools/fsi.exe --exec "/tmp/pamac-build-chaka/fsharp/src/fsharp/src/scripts/subst.fsx" --in:"/tmp/pamac-build-chaka/fsharp/src/fsharp/src/fsharp/FSharp.Build/Microsoft.FSharp.Targets" --out:"/tmp/pamac-build-chaka/fsharp/src/fsharp/src/fsharp/FSharp.Build-proto/../../../Proto/net40/bin/Microsoft.FSharp-proto.targets" --pattern1:"{BuildSuffix}" --replacement1:"-proto" --pattern2:"" --replacement2:"" " exited with code 1. [/tmp/pamac-build-chaka/fsharp/src/fsharp/src/fsharp/FSharp.Build-proto/FSharp.Build-proto.fsproj]
    
        0 Warning(s)
        2 Error(s)
    
    Time Elapsed 00:00:07.59
    make[1]: *** [Makefile:17: build-proto] Error 1
    make[1]: Leaving directory '/tmp/pamac-build-chaka/fsharp/src/fsharp'
    make: *** [Makefile:13: all] Error 2
    ==> ERROR: A failure occurred in build().
        Aborting...
    

    I know that’s a lot of code. Can someone guide me how to get this done?

  • @chaka which version are you trying to install?

    In AUR I see:

    monodevelop-stable
    monodevelop-stable-bin
    monodevelop-beta
    monodevelop-git
    

    If you can’t compile it using the first one, then I’d try the second one, that’s already compiled.

  • I tried both stable and stable bin and yet I get :

    [[email protected] ~]$ yaourt mono develop
    1 extra/mono-tools 4.2-1
        collection of testing and development tools for use with mono (including monodoc browser)
    2 aur/monodevelop-beta 6.2.0.1798-1 (Out of Date) (2) (0.00)
        An IDE primarily designed for C# and other .NET languages - Beta channel. WARNING: this package requires over 500 
        MB worth of data to be downloaded.
    3 aur/monodevelop-emmetplugin 20140115-1 (0) (0.00)
        This is an attempt to create emmet plugin for Monodevelop.
    4 aur/monodevelop-git r47310-1 (1) (0.00)
        An IDE primarily designed for C# and other .NET languages - built from git sources. WARNING: building this package 
        will require you to download >500 MB worth of data.
    5 aur/monodevelop-git-nuget3 r48043-2 (Out of Date) (0) (0.00)
        An IDE primarily designed for C# and other .NET languages - built from git sources. WARNING: building this package 
        will require you to download >500 MB worth of data.
    6 aur/monodevelop-stable 7.6.0.1760-1 (19) (2.00)
        An IDE primarily designed for C# and other .NET languages
    7 aur/monodevelop-stable-bin 7.5.0.1244-1 (2) (0.25)
        An IDE primarily designed for C# and other .NET languages
    8 aur/monoobsframework 1.0.2-1 (0) (0.00)
        A library write in CSharp (C#) to use the OpenSuse Build Service (OBS) planed to propose at MonoDevelop team
    9 aur/monoosc 1.0.2-1 (0) (0.00)
        MonoOSC is a project in two part, a library write in CSharp (C#) to use the OpenSuse Build Service (OBS) planed to 
        propose at MonoDevelop team and a second part will be a nice GUI who use the library.
    10 aur/opentk 2:1.1_4c-1 (6) (0.00)
        Open source game development toolkit for .Net/Mono.
    11 aur/pymonopoly-git 0.495-1 (0) (0.00)
        Famous monopoly board game (russian variation - 'Manager'). In active development
    ==> Enter n° of packages to be installed (e.g., 1 2 3 or 1-3)
    ==> ---------------------------------------------------------
    ==> 7                                                               
    
    
    ==> Downloading monodevelop-stable-bin PKGBUILD from AUR...
    x .SRCINFO
    x PKGBUILD
    doctorzeus commented on 2018-05-05 03:54			 
    
    malah commented on 2018-05-05 10:38			 
    
    frol commented on 2018-08-13 16:02			 
    
    doctorzeus commented on 2018-08-13 23:52			 
    
    monodevelop-stable-bin 7.5.0.1244-1  (2018-05-05 03:49)
    ( Unsupported package: Potentially dangerous ! )
    ==> Edit PKGBUILD ? [Y/n] ("A" to abort)
    ==> ------------------------------------
    ==> n
    
    ==> monodevelop-stable-bin dependencies:
     - mono (already installed)
     - mono-addins>=0.6.2 (already installed)
     - gtk-sharp-2 (already installed)
     - libssh2 (already installed)
     - curl (already installed)
     - msbuild-stable (already installed)
     - rsync (already installed) [makedepend]
     - cmake (already installed) [makedepend]
     - git (already installed) [makedepend]
     - nuget (already installed) [makedepend]
     - openssl-1.0 (already installed) [makedepend]
     - xterm (already installed) [makedepend]
     - fsharp (building from AUR)
    
    
    ==> Continue building monodevelop-stable-bin ? [Y/n]
    ==> ------------------------------------------------
    ==> Y
    
    ==> Building and installing package
    ==> Install or build missing dependencies for monodevelop-stable-bin:
    
    ==> Downloading fsharp PKGBUILD from AUR...
    x .SRCINFO
    x Makefile
    x PKGBUILD
    x check4u
    puffybsd commented on 2018-04-17 02:42			 
    
    ArchLinuxTux commented on 2018-04-21 11:38			 
    
    peteraba commented on 2018-08-03 09:48			 
    
    brettgilio commented on 2018-08-08 02:27			 
    
    peteraba commented on 2018-08-09 09:47			 
    
    fsharp 4.1.34-2  (2018-06-11 02:38)
    ( Unsupported package: Potentially dangerous ! )
    ==> Edit PKGBUILD ? [Y/n] ("A" to abort)
    ==> ------------------------------------
    ==> n
    
    ==> fsharp dependencies:
     - mono (already installed)
     - msbuild-stable (already installed)
     - git (already installed) [makedepend]
    
    
    ==> Continue building fsharp ? [Y/n]
    ==> --------------------------------
    ==> Y
    
    ==> Building and installing package
    ==> Making package: fsharp 4.1.34-2 (Sat 18 Aug 2018 07:14:55 PM CEST)
    ==> Checking runtime dependencies...
    ==> Checking buildtime dependencies...
    ==> Retrieving sources...
      -> Cloning fsharp git repo...
    Cloning into bare repository '/tmp/yaourt-tmp-chaka/aur-fsharp/fsharp'...
    remote: Counting objects: 87457, done.
    remote: Compressing objects: 100% (132/132), done.
    remote: Total 87457 (delta 41), reused 48 (delta 15), pack-reused 87307
    Receiving objects: 100% (87457/87457), 187.17 MiB | 418.00 KiB/s, done.
    Resolving deltas: 100% (61869/61869), done.
    ==> Validating source files with sha256sums...
        fsharp ... Skipped
    ==> Extracting sources...
      -> Creating working copy of fsharp git repo...
    Cloning into 'fsharp'...
    done.
    Switched to a new branch 'makepkg'
    ==> Starting pkgver()...
    ==> Starting build()...
    checking whether make sets $(MAKE)... yes
    checking for pkg-config... /usr/bin/pkg-config
    configure: "pkg-config: /usr/bin/pkg-config"
    configure: "PKG_CONFIG_LIBDIR: "
    checking for msbuild... /usr/bin/msbuild
    configure: msbuild: /usr/bin/msbuild
    configure: creating ./config.status
    config.status: creating mono/launcher
    config.status: creating mono/config.make
    make build-proto
    make[1]: Entering directory '/tmp/yaourt-tmp-chaka/aur-fsharp/src/fsharp'
    MONO_ENV_OPTIONS= mono .nuget/NuGet.exe restore packages.config -PackagesDirectory packages -ConfigFile .nuget/NuGet.Config
    Restoring NuGet package Microsoft.Build.Utilities.Core.14.3.0.
    Restoring NuGet package Microsoft.Build.Framework.14.3.0.
    Restoring NuGet package System.Collections.Immutable.1.3.1.
    Restoring NuGet package MicroBuild.Core.0.2.0.
    Restoring NuGet package System.ValueTuple.4.3.1.
    Restoring NuGet package FsLexYacc.7.0.6.
    Restoring NuGet package Microsoft.DiaSymReader.PortablePdb.1.2.0.
    Restoring NuGet package System.Reflection.Metadata.1.4.2.
    Restoring NuGet package Microsoft.Build.14.3.0.
    Restoring NuGet package Microsoft.DiaSymReader.1.1.0.
    Adding package 'System.Collections.Immutable.1.3.1' to folder '/tmp/yaourt-tmp-chaka/aur-fsharp/src/fsharp/packages'
    Adding package 'Microsoft.Build.14.3.0' to folder '/tmp/yaourt-tmp-chaka/aur-fsharp/src/fsharp/packages'
    Adding package 'Microsoft.Build.Utilities.Core.14.3.0' to folder '/tmp/yaourt-tmp-chaka/aur-fsharp/src/fsharp/packages'
    Adding package 'Microsoft.DiaSymReader.PortablePdb.1.2.0' to folder '/tmp/yaourt-tmp-chaka/aur-fsharp/src/fsharp/packages'
    Adding package 'FsLexYacc.7.0.6' to folder '/tmp/yaourt-tmp-chaka/aur-fsharp/src/fsharp/packages'
    Adding package 'Microsoft.DiaSymReader.1.1.0' to folder '/tmp/yaourt-tmp-chaka/aur-fsharp/src/fsharp/packages'
    Adding package 'System.Reflection.Metadata.1.4.2' to folder '/tmp/yaourt-tmp-chaka/aur-fsharp/src/fsharp/packages'
    Adding package 'Microsoft.Build.Framework.14.3.0' to folder '/tmp/yaourt-tmp-chaka/aur-fsharp/src/fsharp/packages'
    Adding package 'System.ValueTuple.4.3.1' to folder '/tmp/yaourt-tmp-chaka/aur-fsharp/src/fsharp/packages'
    Adding package 'MicroBuild.Core.0.2.0' to folder '/tmp/yaourt-tmp-chaka/aur-fsharp/src/fsharp/packages'
    Added package 'MicroBuild.Core.0.2.0' to folder '/tmp/yaourt-tmp-chaka/aur-fsharp/src/fsharp/packages'
    Added package 'Microsoft.Build.Framework.14.3.0' to folder '/tmp/yaourt-tmp-chaka/aur-fsharp/src/fsharp/packages'
    Restoring NuGet package FsCheck.2.6.2.
    Restoring NuGet package Microsoft.Build.Tasks.Core.14.3.0.
    Added package 'Microsoft.DiaSymReader.PortablePdb.1.2.0' to folder '/tmp/yaourt-tmp-chaka/aur-fsharp/src/fsharp/packages'
    Added package 'Microsoft.DiaSymReader.1.1.0' to folder '/tmp/yaourt-tmp-chaka/aur-fsharp/src/fsharp/packages'
    Restoring NuGet package NUnit.3.5.0.
    Restoring NuGet package NUnit.Console.3.0.0.
    Added package 'Microsoft.Build.Utilities.Core.14.3.0' to folder '/tmp/yaourt-tmp-chaka/aur-fsharp/src/fsharp/packages'
    Restoring NuGet package NUnitLite.3.5.0.
    Added package 'System.ValueTuple.4.3.1' to folder '/tmp/yaourt-tmp-chaka/aur-fsharp/src/fsharp/packages'
    Restoring NuGet package NUnit3TestAdapter.3.0.8-ctp-8.
    Adding package 'NUnit.Console.3.0.0' to folder '/tmp/yaourt-tmp-chaka/aur-fsharp/src/fsharp/packages'
    Added package 'Microsoft.Build.14.3.0' to folder '/tmp/yaourt-tmp-chaka/aur-fsharp/src/fsharp/packages'
    Adding package 'FsCheck.2.6.2' to folder '/tmp/yaourt-tmp-chaka/aur-fsharp/src/fsharp/packages'
    Added package 'System.Collections.Immutable.1.3.1' to folder '/tmp/yaourt-tmp-chaka/aur-fsharp/src/fsharp/packages'
    Restoring NuGet package BenchmarkDotNet.0.9.8.
    Adding package 'NUnit.3.5.0' to folder '/tmp/yaourt-tmp-chaka/aur-fsharp/src/fsharp/packages'
    Restoring NuGet package BenchmarkDotNet.Diagnostics.Windows.0.9.8.
    Added package 'System.Reflection.Metadata.1.4.2' to folder '/tmp/yaourt-tmp-chaka/aur-fsharp/src/fsharp/packages'
    Adding package 'Microsoft.Build.Tasks.Core.14.3.0' to folder '/tmp/yaourt-tmp-chaka/aur-fsharp/src/fsharp/packages'
    Restoring NuGet package Newtonsoft.Json.8.0.1.
    Adding package 'NUnit3TestAdapter.3.0.8-ctp-8' to folder '/tmp/yaourt-tmp-chaka/aur-fsharp/src/fsharp/packages'
    Adding package 'NUnitLite.3.5.0' to folder '/tmp/yaourt-tmp-chaka/aur-fsharp/src/fsharp/packages'
    Adding package 'BenchmarkDotNet.0.9.8' to folder '/tmp/yaourt-tmp-chaka/aur-fsharp/src/fsharp/packages'
    Added package 'FsLexYacc.7.0.6' to folder '/tmp/yaourt-tmp-chaka/aur-fsharp/src/fsharp/packages'
    Restoring NuGet package FSharp.Compiler.Tools.4.1.27.
    Added package 'NUnit3TestAdapter.3.0.8-ctp-8' to folder '/tmp/yaourt-tmp-chaka/aur-fsharp/src/fsharp/packages'
    Restoring NuGet package Microsoft.Portable.FSharp.Core.4.1.20.
    Adding package 'BenchmarkDotNet.Diagnostics.Windows.0.9.8' to folder '/tmp/yaourt-tmp-chaka/aur-fsharp/src/fsharp/packages'
    Adding package 'Newtonsoft.Json.8.0.1' to folder '/tmp/yaourt-tmp-chaka/aur-fsharp/src/fsharp/packages'
    Added package 'BenchmarkDotNet.Diagnostics.Windows.0.9.8' to folder '/tmp/yaourt-tmp-chaka/aur-fsharp/src/fsharp/packages'
    Restoring NuGet package FSharp.Core.4.1.17.
    Adding package 'FSharp.Compiler.Tools.4.1.27' to folder '/tmp/yaourt-tmp-chaka/aur-fsharp/src/fsharp/packages'
    Added package 'BenchmarkDotNet.0.9.8' to folder '/tmp/yaourt-tmp-chaka/aur-fsharp/src/fsharp/packages'
    Added package 'Microsoft.Build.Tasks.Core.14.3.0' to folder '/tmp/yaourt-tmp-chaka/aur-fsharp/src/fsharp/packages'
    Restoring NuGet package FSharp.Core.4.0.0.1.
    Restoring NuGet package FSharp.Core.3.1.2.5.
    Added package 'NUnitLite.3.5.0' to folder '/tmp/yaourt-tmp-chaka/aur-fsharp/src/fsharp/packages'
    Added package 'NUnit.Console.3.0.0' to folder '/tmp/yaourt-tmp-chaka/aur-fsharp/src/fsharp/packages'
    Restoring NuGet package FSharp.Core.3.0.2.
    Restoring NuGet package FSharp.Data.2.2.5.
    Adding package 'Microsoft.Portable.FSharp.Core.4.1.20' to folder '/tmp/yaourt-tmp-chaka/aur-fsharp/src/fsharp/packages'
    Adding package 'FSharp.Core.4.1.17' to folder '/tmp/yaourt-tmp-chaka/aur-fsharp/src/fsharp/packages'
    Adding package 'FSharp.Core.4.0.0.1' to folder '/tmp/yaourt-tmp-chaka/aur-fsharp/src/fsharp/packages'
    Adding package 'FSharp.Core.3.1.2.5' to folder '/tmp/yaourt-tmp-chaka/aur-fsharp/src/fsharp/packages'
    Adding package 'FSharp.Core.3.0.2' to folder '/tmp/yaourt-tmp-chaka/aur-fsharp/src/fsharp/packages'
    Adding package 'FSharp.Data.2.2.5' to folder '/tmp/yaourt-tmp-chaka/aur-fsharp/src/fsharp/packages'
    Added package 'FsCheck.2.6.2' to folder '/tmp/yaourt-tmp-chaka/aur-fsharp/src/fsharp/packages'
    Restoring NuGet package FSharp.Configuration.1.3.0.
    Added package 'NUnit.3.5.0' to folder '/tmp/yaourt-tmp-chaka/aur-fsharp/src/fsharp/packages'
    Added package 'Newtonsoft.Json.8.0.1' to folder '/tmp/yaourt-tmp-chaka/aur-fsharp/src/fsharp/packages'
    Adding package 'FSharp.Configuration.1.3.0' to folder '/tmp/yaourt-tmp-chaka/aur-fsharp/src/fsharp/packages'
    Added package 'FSharp.Core.3.0.2' to folder '/tmp/yaourt-tmp-chaka/aur-fsharp/src/fsharp/packages'
    Added package 'FSharp.Configuration.1.3.0' to folder '/tmp/yaourt-tmp-chaka/aur-fsharp/src/fsharp/packages'
    Added package 'FSharp.Data.2.2.5' to folder '/tmp/yaourt-tmp-chaka/aur-fsharp/src/fsharp/packages'
    Added package 'FSharp.Core.3.1.2.5' to folder '/tmp/yaourt-tmp-chaka/aur-fsharp/src/fsharp/packages'
    Added package 'FSharp.Core.4.0.0.1' to folder '/tmp/yaourt-tmp-chaka/aur-fsharp/src/fsharp/packages'
    Added package 'FSharp.Core.4.1.17' to folder '/tmp/yaourt-tmp-chaka/aur-fsharp/src/fsharp/packages'
    Added package 'FSharp.Compiler.Tools.4.1.27' to folder '/tmp/yaourt-tmp-chaka/aur-fsharp/src/fsharp/packages'
    Added package 'Microsoft.Portable.FSharp.Core.4.1.20' to folder '/tmp/yaourt-tmp-chaka/aur-fsharp/src/fsharp/packages'
    
    NuGet Config files used:
        /tmp/yaourt-tmp-chaka/aur-fsharp/src/fsharp/.nuget/NuGet.Config
    
    Feeds used:
        /home/chaka/.nuget/packages/
        https://api.nuget.org/v3/index.json
    
    Installed:
        27 package(s) to packages.config projects
    MONO_ENV_OPTIONS= /usr/bin/msbuild /p:Configuration=Proto /p:TargetDotnetProfile=net40 src/fsharp/FSharp.Build-proto/FSharp.Build-proto.fsproj
    Microsoft (R) Build Engine version 15.6.0.0 ( Fri Apr  6 15:55:10 UTC 2018) for Mono
    Copyright (C) Microsoft Corporation. All rights reserved.
    
    Build started 8/18/2018 7:22:48 PM.
    Project "/tmp/yaourt-tmp-chaka/aur-fsharp/src/fsharp/src/fsharp/FSharp.Build-proto/FSharp.Build-proto.fsproj" on node 1 (default targets).
    CallFsSrGen:
      Creating directory "obj/Proto/net40/".
      mono /tmp/yaourt-tmp-chaka/aur-fsharp/src/fsharp/packages/FSharp.Compiler.Tools.4.1.27/tools/fsi.exe --exec "/tmp/yaourt-tmp-chaka/aur-fsharp/src/fsharp/src/scripts/fssrgen.fsx" "/tmp/yaourt-tmp-chaka/aur-fsharp/src/fsharp/src/fsharp/FSharp.Build/FSBuild.txt" "obj/Proto/net40/FSBuild.fs"  "obj/Proto/net40/FSBuild.resx" 
      fssrgen: args = [|"/tmp/yaourt-tmp-chaka/aur-fsharp/src/fsharp/src/scripts/fssrgen.fsx";
        "/tmp/yaourt-tmp-chaka/aur-fsharp/src/fsharp/src/fsharp/FSharp.Build/FSBuild.txt";
        "obj/Proto/net40/FSBuild.fs"; "obj/Proto/net40/FSBuild.resx"|]
      fssrgen.fsx: Reading /tmp/yaourt-tmp-chaka/aur-fsharp/src/fsharp/src/fsharp/FSharp.Build/FSBuild.txt
      fssrgen.fsx: Parsing /tmp/yaourt-tmp-chaka/aur-fsharp/src/fsharp/src/fsharp/FSharp.Build/FSBuild.txt
      fssrgen.fsx: Validating /tmp/yaourt-tmp-chaka/aur-fsharp/src/fsharp/src/fsharp/FSharp.Build/FSBuild.txt
      fssrgen.fsx: Validating uniqueness of /tmp/yaourt-tmp-chaka/aur-fsharp/src/fsharp/src/fsharp/FSharp.Build/FSBuild.txt
      fssrgen.fsx: Generating /tmp/yaourt-tmp-chaka/aur-fsharp/src/fsharp/src/fsharp/FSharp.Build-proto/obj/Proto/net40/FSBuild.fs
      fssrgen.fsx: Generating resource methods for /tmp/yaourt-tmp-chaka/aur-fsharp/src/fsharp/src/fsharp/FSharp.Build-proto/obj/Proto/net40/FSBuild.fs
      fssrgen.fsx: Generating .resx for /tmp/yaourt-tmp-chaka/aur-fsharp/src/fsharp/src/fsharp/FSharp.Build-proto/obj/Proto/net40/FSBuild.fs
      fssrgen.fsx: Done /tmp/yaourt-tmp-chaka/aur-fsharp/src/fsharp/src/fsharp/FSharp.Build-proto/obj/Proto/net40/FSBuild.fs
    PrepareForBuild:
      Creating directory "/tmp/yaourt-tmp-chaka/aur-fsharp/src/fsharp/src/fsharp/FSharp.Build-proto/../../../Proto/net40/bin/".
    CoreResGen:
      /usr/lib/mono/4.5/resgen.exe /useSourcePath /r:/tmp/yaourt-tmp-chaka/aur-fsharp/src/fsharp/packages/Microsoft.Build.14.3.0/lib/net45/Microsoft.Build.dll /r:/tmp/yaourt-tmp-chaka/aur-fsharp/src/fsharp/packages/Microsoft.Build.Framework.14.3.0/lib/net45/Microsoft.Build.Framework.dll /r:/tmp/yaourt-tmp-chaka/aur-fsharp/src/fsharp/packages/Microsoft.Build.Tasks.Core.14.3.0/lib/net45/Microsoft.Build.Tasks.Core.dll /r:/tmp/yaourt-tmp-chaka/aur-fsharp/src/fsharp/packages/Microsoft.Build.Utilities.Core.14.3.0/lib/net45/Microsoft.Build.Utilities.Core.dll /r:/usr/lib/mono/4.5-api/mscorlib.dll /r:/usr/lib/mono/4.5-api/System.Core.dll /r:/usr/lib/mono/4.5-api/System.dll /r:/usr/lib/mono/4.5-api/System.Numerics.dll /r:/usr/lib/mono/4.5-api/System.Xml.dll /r:/usr/lib/mono/4.5-api/System.Xml.Linq.dll /compile obj/Proto/net40/FSBuild.resx,obj/Proto/net40/FSBuild.resources
      Processing resource file "obj/Proto/net40/FSBuild.resx" into "obj/Proto/net40/FSBuild.resources".
    CoreCompile:
      /tmp/yaourt-tmp-chaka/aur-fsharp/src/fsharp/packages/FSharp.Compiler.Tools.4.1.27/tools/fsc.exe -o:obj/Proto/net40/FSharp.Build-proto.dll
      -g
      --debug:portable
      --noframework
      --define:MSBUILD_AT_LEAST_14
      --define:STRONG_NAME_FSHARP_COMPILER_WITH_TEST_KEY
      --define:BUILDING_WITH_LKG
      --define:DEBUG
      --define:NO_STRONG_NAMES
      --define:VS_VERSION_DEV15
      --define:CROSS_PLATFORM_COMPILER
      --define:ENABLE_MONO_SUPPORT
      --define:BE_SECURITY_TRANSPARENT
      --define:FX_LCIDFROMCODEPAGE
      --doc:/tmp/yaourt-tmp-chaka/aur-fsharp/src/fsharp/src/fsharp/FSharp.Build-proto/../../../Proto/net40/bin/FSharp.Build-proto.xml
      --keyfile:/tmp/yaourt-tmp-chaka/aur-fsharp/src/fsharp/src/fsharp/FSharp.Build-proto/../../fsharp/test.snk
      --optimize+
      --resource:obj/Proto/net40/FSBuild.resources
      -r:/tmp/yaourt-tmp-chaka/aur-fsharp/src/fsharp/src/fsharp/FSharp.Build-proto/../../../packages/Microsoft.Build.14.3.0/lib/net45/Microsoft.Build.dll
      -r:/tmp/yaourt-tmp-chaka/aur-fsharp/src/fsharp/src/fsharp/FSharp.Build-proto/../../../packages/Microsoft.Build.Framework.14.3.0/lib/net45/Microsoft.Build.Framework.dll
      -r:/tmp/yaourt-tmp-chaka/aur-fsharp/src/fsharp/src/fsharp/FSharp.Build-proto/../../../packages/Microsoft.Build.Tasks.Core.14.3.0/lib/net45/Microsoft.Build.Tasks.Core.dll
      -r:/tmp/yaourt-tmp-chaka/aur-fsharp/src/fsharp/src/fsharp/FSharp.Build-proto/../../../packages/Microsoft.Build.Utilities.Core.14.3.0/lib/net45/Microsoft.Build.Utilities.Core.dll
      -r:/usr/lib/mono/4.5-api/mscorlib.dll
      -r:/usr/lib/mono/4.5-api/System.Core.dll
      -r:/usr/lib/mono/4.5-api/System.dll
      -r:/usr/lib/mono/4.5-api/System.Numerics.dll
      -r:/usr/lib/mono/4.5-api/System.Xml.dll
      -r:/usr/lib/mono/4.5-api/System.Xml.Linq.dll
      --target:library
      --nowarn:69,65,54,61,75
      --warn:3
      --warnaserror
      --warnaserror:76
      --fullpaths
      --flaterrors
      --subsystemversion:6.00
      --highentropyva+
      --times
      --version:4.4.1.0
      obj/Proto/net40/FSBuild.fs
      ../../utils/CompilerLocationUtils.fs
      ../FSharp.Build/CreateFSharpManifestResourceName.fs
      ../FSharp.Build/FSharpCommandLineBuilder.fs
      ../FSharp.Build/Fsc.fs
      ../FSharp.Build/FSharpEmbedResourceText.fs
      ../FSharp.Build/FSharpEmbedResXSource.fs
      ../FSharp.Build/WriteCodeFragment.fs
      /tmp/.NETFramework,Version=v4.5.AssemblyAttributes.fs
      
    CopyAndSubstituteTextFiles:
      mono /tmp/yaourt-tmp-chaka/aur-fsharp/src/fsharp/packages/FSharp.Compiler.Tools.4.1.27/tools/fsi.exe --exec "/tmp/yaourt-tmp-chaka/aur-fsharp/src/fsharp/src/scripts/subst.fsx" --in:"/tmp/yaourt-tmp-chaka/aur-fsharp/src/fsharp/src/fsharp/FSharp.Build/Microsoft.FSharp.Targets" --out:"/tmp/yaourt-tmp-chaka/aur-fsharp/src/fsharp/src/fsharp/FSharp.Build-proto/../../../Proto/net40/bin/Microsoft.FSharp-proto.targets" --pattern1:"{BuildSuffix}" --replacement1:"-proto" --pattern2:"" --replacement2:"" 
      
      
    /tmp/yaourt-tmp-chaka/aur-fsharp/src/fsharp/src/scripts/scriptlib.fsx(40,39): error FS0041: A unique overload for method 'StartsWith' could not be determined based on type information prior to this program point. A type annotation may be needed. Candidates: String.StartsWith(value: char) : bool, String.StartsWith(value: string) : bool [/tmp/yaourt-tmp-chaka/aur-fsharp/src/fsharp/src/fsharp/FSharp.Build-proto/FSharp.Build-proto.fsproj]
      
    /tmp/yaourt-tmp-chaka/aur-fsharp/src/fsharp/src/FSharpSource.targets(207,5): error MSB3073: The command "mono /tmp/yaourt-tmp-chaka/aur-fsharp/src/fsharp/packages/FSharp.Compiler.Tools.4.1.27/tools/fsi.exe --exec "/tmp/yaourt-tmp-chaka/aur-fsharp/src/fsharp/src/scripts/subst.fsx" --in:"/tmp/yaourt-tmp-chaka/aur-fsharp/src/fsharp/src/fsharp/FSharp.Build/Microsoft.FSharp.Targets" --out:"/tmp/yaourt-tmp-chaka/aur-fsharp/src/fsharp/src/fsharp/FSharp.Build-proto/../../../Proto/net40/bin/Microsoft.FSharp-proto.targets" --pattern1:"{BuildSuffix}" --replacement1:"-proto" --pattern2:"" --replacement2:"" " exited with code 1. [/tmp/yaourt-tmp-chaka/aur-fsharp/src/fsharp/src/fsharp/FSharp.Build-proto/FSharp.Build-proto.fsproj]
    Done Building Project "/tmp/yaourt-tmp-chaka/aur-fsharp/src/fsharp/src/fsharp/FSharp.Build-proto/FSharp.Build-proto.fsproj" (default targets) -- FAILED.
    
    Build FAILED.
    
    "/tmp/yaourt-tmp-chaka/aur-fsharp/src/fsharp/src/fsharp/FSharp.Build-proto/FSharp.Build-proto.fsproj" (default target) (1) ->
    (CopyAndSubstituteTextFiles target) -> 
      /tmp/yaourt-tmp-chaka/aur-fsharp/src/fsharp/src/scripts/scriptlib.fsx(40,39): error FS0041: A unique overload for method 'StartsWith' could not be determined based on type information prior to this program point. A type annotation may be needed. Candidates: String.StartsWith(value: char) : bool, String.StartsWith(value: string) : bool [/tmp/yaourt-tmp-chaka/aur-fsharp/src/fsharp/src/fsharp/FSharp.Build-proto/FSharp.Build-proto.fsproj]
      /tmp/yaourt-tmp-chaka/aur-fsharp/src/fsharp/src/FSharpSource.targets(207,5): error MSB3073: The command "mono /tmp/yaourt-tmp-chaka/aur-fsharp/src/fsharp/packages/FSharp.Compiler.Tools.4.1.27/tools/fsi.exe --exec "/tmp/yaourt-tmp-chaka/aur-fsharp/src/fsharp/src/scripts/subst.fsx" --in:"/tmp/yaourt-tmp-chaka/aur-fsharp/src/fsharp/src/fsharp/FSharp.Build/Microsoft.FSharp.Targets" --out:"/tmp/yaourt-tmp-chaka/aur-fsharp/src/fsharp/src/fsharp/FSharp.Build-proto/../../../Proto/net40/bin/Microsoft.FSharp-proto.targets" --pattern1:"{BuildSuffix}" --replacement1:"-proto" --pattern2:"" --replacement2:"" " exited with code 1. [/tmp/yaourt-tmp-chaka/aur-fsharp/src/fsharp/src/fsharp/FSharp.Build-proto/FSharp.Build-proto.fsproj]
    
        0 Warning(s)
        2 Error(s)
    
    Time Elapsed 00:00:08.12
    make[1]: *** [Makefile:17: build-proto] Error 1
    make[1]: Leaving directory '/tmp/yaourt-tmp-chaka/aur-fsharp/src/fsharp'
    make: *** [Makefile:13: all] Error 2
    ==> ERROR: A failure occurred in build().
        Aborting...
    ==> ERROR: Makepkg was unable to build fsharp.
    ==> Restart building fsharp ? [y/N]
    ==> -------------------------------
    ==> 
    
    

    Also I’d like to add that codeblocks, atom and xampp have been installed properly. I don’t know what dependencies my OS lacks. But during installation process nothing showed up (I mean error or bad internet connection).

  • @chaka said in mono develop install error:

    fsharp

    a dependency is not buildig, as you can see…

    https://aur.archlinux.org/packages/fsharp/

    [updates once a week] = [90% less problems]
    antergos:_rescue
    how to add system logs:
    wget http://bit.ly/2GCG9k2 && sh 2GCG9k2
    :handshake: donate antergos

  • Ok, I tried various methods mentioned in comments. None of them work.

    I installed mono + msbuild-stable then tried to launch PKGBUILD with additional Term = xterm line. - Same error
    Installed mono-stable + msbuild-stable and PKGBUILD with Term = xterm - Nada.
    (I tried both via add/remove software for mono and msbuild-stable and by downloading snapshot from AUR. that Term = xterm in various configurations - on top , inside build method, outside method, bottom)

    I’m blind as a child in dark forest. Could someone help me. I really want to get this up and running.

error286 mono4 develop1 Posts 5Views 306
Log in to reply
Bloom Email Optin Plugin

Looks like your connection to Antergos Community Forum was lost, please wait while we try to reconnect.